Target
Kinesin-like protein KIF11
Ligand
BDBM50220328
Substrate
Meas. Tech.
ChEMBL_449205 (CHEMBL898408)
IC50
5.2±n/a nM
Citation
 Coleman, PJSchreier, JDCox, CDFraley, MEGarbaccio, RMBuser, CAWalsh, ESHamilton, KLobell, RBRickert, KTao, WDiehl, RESouth, VJDavide, JPKohl, NEYan, YKuo, LPrueksaritanont, TLi, CMahan, EAFernandez-Metzler, CSalata, JJHartman, GD Kinesin spindle protein (KSP) inhibitors. Part 6: Design and synthesis of 3,5-diaryl-4,5-dihydropyrazole amides as potent inhibitors of the mitotic kinesin KSP. Bioorg Med Chem Lett 17:5390-5 (2007)  
Target
Name:
Kinesin-like protein KIF11
Synonyms:
EG5 KIF11_HUMAN Kinesin Spindle Protein Eg5 TRIP5 | kinesin spindle protein
Type:
PROTEIN
Mol. Mass.:
119138.97
Organism:
Homo sapiens (Human)
Description:
ChEMBL_1457426
Residue:
1056
  
Inhibitor
Name:
BDBM50220328
Synonyms:
(S)-2-((R)-3-amino-4,4-difluorobutyl)-4-(2,5-difluorophenyl)-N,N-dimethyl-2-phenyl-2H-pyrrole-1(5H)-carboxamide | CHEMBL240923
Type:
Small organic molecule
Emp. Form.:
C23H25F4N3O
Mol. Mass.:
435.4577
SMILES:
CN(C)C(=O)N1CC(=C[C@@]1(CC[C@@H](N)C(F)F)c1ccccc1)c1cc(F)ccc1F
: