Target
Hydroxycarboxylic acid receptor 3
Ligand
BDBM23515
Substrate
Meas. Tech.
ChEMBL_449369 (CHEMBL899636)
EC50
75858±n/a nM
Citation
 Skinner, PJCherrier, MCWebb, PJShin, YJGharbaoui, TLindstrom, AHong, VTamura, SYDang, HTPride, CCChen, RRichman, JGConnolly, DTSemple, G Fluorinated pyrazole acids are agonists of the high affinity niacin receptor GPR109a. Bioorg Med Chem Lett 17:5620-3 (2007)  
Target
Name:
Hydroxycarboxylic acid receptor 3
Synonyms:
G-protein coupled receptor 109B G-protein coupled receptor HM74B HCA3 HCAR3_HUMAN HM74B NIACR2 Nicotinic acid receptor 2
Type:
Enzyme Catalytic Domain
Mol. Mass.:
44498.06
Organism:
Homo sapiens (Human)
Description:
GPR109B 0 HUMAN::P49019
Residue:
387
  
Inhibitor
Name:
BDBM23515
Synonyms:
CHEMBL573 Nicotinic Acid pyridine-3-carboxylic acid | wampocap
Type:
Small organic molecule
Emp. Form.:
C6H5NO2
Mol. Mass.:
123.1094
SMILES:
OC(=O)c1cccnc1
: