Target
Serine/threonine-protein kinase Chk1
Ligand
BDBM50220907
Substrate
Meas. Tech.
ChEMBL_457438 (CHEMBL941010)
IC50
850±n/a nM
Citation
 Brnardic, EJGarbaccio, RMFraley, METasber, ESSteen, JTArrington, KLDudkin, VYHartman, GDStirdivant, SMDrakas, BARickert, KWalsh, ESHamilton, KBuser, CAHardwick, JTao, WBeck, SCMao, XLobell, RBSepp-Lorenzino, LYan, YIkuta, MMunshi, SKKuo, LCKreatsoulas, C Optimization of a pyrazoloquinolinone class of Chk1 kinase inhibitors. Bioorg Med Chem Lett 17:5989-94 (2007)  
Target
Name:
Serine/threonine-protein kinase Chk1
Synonyms:
CHEK1 CHK1 checkpoint homolog Checkpoint kinase-1 (CHK1)
Type:
Enzyme Catalytic Domain
Mol. Mass.:
54443.02
Organism:
Homo sapiens (Human)
Description:
gi_166295192
Residue:
476
  
Inhibitor
Name:
BDBM50220907
Synonyms:
2-(8-chloro-3-methyl-2H-pyrazolo[4,3-c]quinolin-4-yloxy)ethanamine | CHEMBL250227
Type:
Small organic molecule
Emp. Form.:
C13H13ClN4O
Mol. Mass.:
276.722
SMILES:
Cc1[nH]nc2c1c(OCCN)nc1ccc(Cl)cc21
: