Target
Serine/threonine-protein kinase Chk1
Ligand
BDBM50220889
Substrate
Meas. Tech.
ChEMBL_457438 (CHEMBL941010)
IC50
40±n/a nM
Citation
 Brnardic, EJGarbaccio, RMFraley, METasber, ESSteen, JTArrington, KLDudkin, VYHartman, GDStirdivant, SMDrakas, BARickert, KWalsh, ESHamilton, KBuser, CAHardwick, JTao, WBeck, SCMao, XLobell, RBSepp-Lorenzino, LYan, YIkuta, MMunshi, SKKuo, LCKreatsoulas, C Optimization of a pyrazoloquinolinone class of Chk1 kinase inhibitors. Bioorg Med Chem Lett 17:5989-94 (2007)  
Target
Name:
Serine/threonine-protein kinase Chk1
Synonyms:
CHEK1 CHK1 checkpoint homolog Checkpoint kinase-1 (CHK1)
Type:
Enzyme Catalytic Domain
Mol. Mass.:
54443.02
Organism:
Homo sapiens (Human)
Description:
gi_166295192
Residue:
476
  
Inhibitor
Name:
BDBM50220889
Synonyms:
8-chloro-3-methyl-2H-pyrazolo[4,3-c]quinolin-4(5H)-one | CHEMBL248627
Type:
Small organic molecule
Emp. Form.:
C11H8ClN3O
Mol. Mass.:
233.654
SMILES:
Cc1[nH]nc2c1c(=O)[nH]c1ccc(Cl)cc21
: