Target
Serine/threonine-protein kinase Chk1
Ligand
BDBM50220886
Substrate
Meas. Tech.
ChEMBL_457438 (CHEMBL941010)
IC50
1.1±n/a nM
Citation
 Brnardic, EJGarbaccio, RMFraley, METasber, ESSteen, JTArrington, KLDudkin, VYHartman, GDStirdivant, SMDrakas, BARickert, KWalsh, ESHamilton, KBuser, CAHardwick, JTao, WBeck, SCMao, XLobell, RBSepp-Lorenzino, LYan, YIkuta, MMunshi, SKKuo, LCKreatsoulas, C Optimization of a pyrazoloquinolinone class of Chk1 kinase inhibitors. Bioorg Med Chem Lett 17:5989-94 (2007)  
Target
Name:
Serine/threonine-protein kinase Chk1
Synonyms:
CHEK1 CHK1 checkpoint homolog Checkpoint kinase-1 (CHK1)
Type:
Enzyme Catalytic Domain
Mol. Mass.:
54443.02
Organism:
Homo sapiens (Human)
Description:
gi_166295192
Residue:
476
  
Inhibitor
Name:
BDBM50220886
Synonyms:
5-(3-aminopropyl)-7,8-dicyclohexyl-3-methyl-2H-pyrazolo[4,3-c]quinolin-4(5H)-one | CHEMBL250481
Type:
Small organic molecule
Emp. Form.:
C26H36N4O
Mol. Mass.:
420.5902
SMILES:
Cc1[nH]nc2c1c(=O)n(CCCN)c1cc(C3CCCCC3)c(cc21)C1CCCCC1
: