Target
Serine/threonine-protein kinase Chk1
Ligand
BDBM50220892
Substrate
Meas. Tech.
ChEMBL_457438 (CHEMBL941010)
IC50
18±n/a nM
Citation
 Brnardic, EJGarbaccio, RMFraley, METasber, ESSteen, JTArrington, KLDudkin, VYHartman, GDStirdivant, SMDrakas, BARickert, KWalsh, ESHamilton, KBuser, CAHardwick, JTao, WBeck, SCMao, XLobell, RBSepp-Lorenzino, LYan, YIkuta, MMunshi, SKKuo, LCKreatsoulas, C Optimization of a pyrazoloquinolinone class of Chk1 kinase inhibitors. Bioorg Med Chem Lett 17:5989-94 (2007)  
Target
Name:
Serine/threonine-protein kinase Chk1
Synonyms:
CHEK1 CHK1 checkpoint homolog Checkpoint kinase-1 (CHK1)
Type:
Enzyme Catalytic Domain
Mol. Mass.:
54443.02
Organism:
Homo sapiens (Human)
Description:
gi_166295192
Residue:
476
  
Inhibitor
Name:
BDBM50220892
Synonyms:
8-(2-amino-acetyl)-5-ethyl-3-methyl-2,5,7,8,9,10-hexahydro-1,2,5,8-tetraaza-cyclopenta[a]anthracen-4-one | CHEMBL400503
Type:
Small organic molecule
Emp. Form.:
C18H21N5O2
Mol. Mass.:
339.3916
SMILES:
CCn1c2cc3CN(CCc3cc2c2n[nH]c(C)c2c1=O)C(=O)CN
: