Target
Potassium voltage-gated channel subfamily H member 2
Ligand
BDBM50220886
Substrate
Meas. Tech.
ChEMBL_457440 (CHEMBL941012)
IC50
5300±n/a nM
Citation
 Brnardic, EJGarbaccio, RMFraley, METasber, ESSteen, JTArrington, KLDudkin, VYHartman, GDStirdivant, SMDrakas, BARickert, KWalsh, ESHamilton, KBuser, CAHardwick, JTao, WBeck, SCMao, XLobell, RBSepp-Lorenzino, LYan, YIkuta, MMunshi, SKKuo, LCKreatsoulas, C Optimization of a pyrazoloquinolinone class of Chk1 kinase inhibitors. Bioorg Med Chem Lett 17:5989-94 (2007)  
Target
Name:
Potassium voltage-gated channel subfamily H member 2
Synonyms:
1,3-beta-glucan synthase component GLS2 ERG Eag-related protein 1 Ether-a-go-go-related gene (HERG) Ether-a-go-go-related gene potassium channel 1 Ether-a-go-go-related gene potassium channel 1 (hERG1) Ether-a-go-go-related protein 1 H-ERG KCNH2 Potassium voltage-gated channel subfamily H member 2 (hERG) Voltage-gated potassium channel subunit Kv11.1 hERG Potassium Channel 1 | putative potassium channel subunit
Type:
Multi-pass membrane protein
Mol. Mass.:
126672.65
Organism:
Homo sapiens (Human)
Description:
Q12809
Residue:
1159
  
Inhibitor
Name:
BDBM50220886
Synonyms:
5-(3-aminopropyl)-7,8-dicyclohexyl-3-methyl-2H-pyrazolo[4,3-c]quinolin-4(5H)-one | CHEMBL250481
Type:
Small organic molecule
Emp. Form.:
C26H36N4O
Mol. Mass.:
420.5902
SMILES:
Cc1[nH]nc2c1c(=O)n(CCCN)c1cc(C3CCCCC3)c(cc21)C1CCCCC1
: