Target
Kinesin-like protein KIF11
Ligand
BDBM50220971
Substrate
Meas. Tech.
ChEMBL_457441 (CHEMBL941013)
IC50
3±n/a nM
Citation
 Garbaccio, RMTasber, ESNeilson, LAColeman, PJFraley, MEOlson, CBergman, JTorrent, MBuser, CARickert, KWalsh, ESHamilton, KLobell, RBTao, WSouth, VJDiehl, REDavide, JPYan, YKuo, LCLi, CPrueksaritanont, TFernandez-Metzler, CMahan, EASlaughter, DESalata, JJKohl, NEHuber, HEHartman, GD Kinesin spindle protein (KSP) inhibitors. Part 7: Design and synthesis of 3,3-disubstituted dihydropyrazolobenzoxazines as potent inhibitors of the mitotic kinesin KSP. Bioorg Med Chem Lett 17:5671-6 (2007)  
Target
Name:
Kinesin-like protein KIF11
Synonyms:
EG5 KIF11_HUMAN Kinesin Spindle Protein Eg5 TRIP5 | kinesin spindle protein
Type:
PROTEIN
Mol. Mass.:
119138.97
Organism:
Homo sapiens (Human)
Description:
ChEMBL_1457426
Residue:
1056
  
Inhibitor
Name:
BDBM50220971
Synonyms:
1-[(R)-4-[3-(4-acetyl-piperazin-1-yl)-propyl]-1-(2,5-difluoro-phenyl)-4-phenyl-4,5-dihydro-1H-pyrazol-3-yl]-ethanone | CHEMBL249882
Type:
Small organic molecule
Emp. Form.:
C26H30F2N4O2
Mol. Mass.:
468.5388
SMILES:
CC(=O)N1CCN(CCC[C@]2(CN(N=C2C(C)=O)c2cc(F)ccc2F)c2ccccc2)CC1
: