Target
Angiopoietin-1 receptor
Ligand
BDBM50221341
Substrate
Meas. Tech.
ChEMBL_449556 (CHEMBL899826)
IC50
260±n/a nM
Citation
 Johnson, NWSemones, MAdams, JLHansbury, MWinkler, J Optimization of triarylimidazoles for Tie2: influence of conformation on potency. Bioorg Med Chem Lett 17:5514-7 (2007)  
Target
Name:
Angiopoietin-1 receptor
Synonyms:
TEK TIE2_HUMAN Tyrosine-protein kinase receptor (TIE-2) Tyrosine-protein kinase receptor TEK (p140 TEK) Tyrosine-protein kinase receptor TIE2/TEK VMCM1 p140 TEK
Type:
Enzyme
Mol. Mass.:
125835.70
Organism:
Homo sapiens (Human)
Description:
Q02763
Residue:
1124
  
Inhibitor
Name:
BDBM50221341
Synonyms:
4-(4-(6-methoxynaphthalen-2-yl)-2-(2-(trifluoromethyl)phenyl)-1H-imidazol-5-yl)pyridine | CHEMBL391889
Type:
Small organic molecule
Emp. Form.:
C26H18F3N3O
Mol. Mass.:
445.4358
SMILES:
COc1ccc2cc(ccc2c1)-c1[nH]c(nc1-c1ccncc1)-c1ccccc1C(F)(F)F
: