Target
Potassium voltage-gated channel subfamily H member 2
Ligand
BDBM50221977
Substrate
Meas. Tech.
ChEMBL_449746 (CHEMBL898851)
IC50
1100±n/a nM
Citation
 Kaelin, DESmenton, ALEiermann, GJHe, HLeiting, BLyons, KAPatel, RAPatel, SBPetrov, AScapin, GWu, JKThornberry, NAWeber, AEDuffy, JL 4-arylcyclohexylalanine analogs as potent, selective, and orally active inhibitors of dipeptidyl peptidase IV. Bioorg Med Chem Lett 17:5806-11 (2007)  
Target
Name:
Potassium voltage-gated channel subfamily H member 2
Synonyms:
1,3-beta-glucan synthase component GLS2 ERG Eag-related protein 1 Ether-a-go-go-related gene (HERG) Ether-a-go-go-related gene potassium channel 1 Ether-a-go-go-related gene potassium channel 1 (hERG1) Ether-a-go-go-related protein 1 H-ERG KCNH2 Potassium voltage-gated channel subfamily H member 2 (hERG) Voltage-gated potassium channel subunit Kv11.1 hERG Potassium Channel 1 | putative potassium channel subunit
Type:
Multi-pass membrane protein
Mol. Mass.:
126672.65
Organism:
Homo sapiens (Human)
Description:
Q12809
Residue:
1159
  
Inhibitor
Name:
BDBM50221977
Synonyms:
(2S,3S)-2-amino-3-(4'-fluoro-biphenyl-4-yl)-1-((S)-3-fluoro-pyrrolidin-1-yl)-butan-1-one CHEMBL237336
Type:
Small organic molecule
Emp. Form.:
C20H22F2N2O
Mol. Mass.:
344.3983
SMILES:
C[C@H]([C@H](N)C(=O)N1CC[C@H](F)C1)c1ccc(cc1)-c1ccc(F)cc1
: