Target
Dipeptidyl peptidase 4
Ligand
BDBM50221977
Substrate
Meas. Tech.
ChEMBL_449743 (CHEMBL898850)
IC50
64±n/a nM
Citation
 Kaelin, DESmenton, ALEiermann, GJHe, HLeiting, BLyons, KAPatel, RAPatel, SBPetrov, AScapin, GWu, JKThornberry, NAWeber, AEDuffy, JL 4-arylcyclohexylalanine analogs as potent, selective, and orally active inhibitors of dipeptidyl peptidase IV. Bioorg Med Chem Lett 17:5806-11 (2007)  
Target
Name:
Dipeptidyl peptidase 4
Synonyms:
ADABP Adenosine deaminase complexing protein 2 CD_antigen=CD26 DPP4 DPPIV Dipeptidyl peptidase 4 (DPP IV) Dipeptidyl peptidase 4 (DPP4) Dipeptidyl peptidase 4 membrane form Dipeptidyl peptidase IV Dipeptidyl peptidase IV (DDP-IV) Dipeptidyl peptidase IV membrane form Dipeptidyl peptidase-IV (DPP-4) T-cell activation antigen CD26 | TP103
Type:
Enzyme
Mol. Mass.:
88271.01
Organism:
Homo sapiens (Human)
Description:
P27487
Residue:
766
  
Inhibitor
Name:
BDBM50221977
Synonyms:
(2S,3S)-2-amino-3-(4'-fluoro-biphenyl-4-yl)-1-((S)-3-fluoro-pyrrolidin-1-yl)-butan-1-one CHEMBL237336
Type:
Small organic molecule
Emp. Form.:
C20H22F2N2O
Mol. Mass.:
344.3983
SMILES:
C[C@H]([C@H](N)C(=O)N1CC[C@H](F)C1)c1ccc(cc1)-c1ccc(F)cc1
: