Target
Transient receptor potential cation channel subfamily V member 1
Ligand
BDBM50223331
Substrate
Meas. Tech.
ChEMBL_458174 (CHEMBL924431)
IC50
17±n/a nM
Citation
 Jetter, MCYoungman, MAMcNally, JJMcDonnell, MEZhang, SPDubin, AENasser, NCodd, EEFlores, CMDax, SL Heteroaryl beta-tetralin ureas as novel antagonists of human TRPV1. Bioorg Med Chem Lett 17:6160-3 (2007)  
Target
Name:
Transient receptor potential cation channel subfamily V member 1
Synonyms:
Capsaicin receptor Osm-9-like TRP channel 1 TRPV1_HUMAN Transient receptor potential cation channel subfamily V member 1 (TRPV1) Transient receptor potential cation channel subfamily V member 1(TRPV1) Vanilloid VR1 Vanilloid receptor 1 Vanilloid receptor 1 (VRI/TRPV1)
Type:
Protein
Mol. Mass.:
94960.75
Organism:
Homo sapiens (Human)
Description:
Q8NER1
Residue:
839
  
Inhibitor
Name:
BDBM50223331
Synonyms:
1-(1-benzyl-6-bromo-1,2,3,4-tetrahydronaphthalen-2-yl)-3-(isoquinolin-5-yl)urea | CHEMBL250558
Type:
Small organic molecule
Emp. Form.:
C27H24BrN3O
Mol. Mass.:
486.403
SMILES:
Brc1ccc2C(Cc3ccccc3)C(CCc2c1)NC(=O)Nc1cccc2cnccc12
: