Target
Integrin alpha-IIb/beta-3
Ligand
BDBM50223891
Substrate
Meas. Tech.
ChEMBL_458248 (CHEMBL925583)
Ki
47±n/a nM
Citation
 Urbahns, KHärter, MAlbers, MSchmidt, DStelte-Ludwig, BBrüggemeier, UVaupel, AKeldenich, JLustig, KTsujishita, HGerdes, C Biphenyls as potent vitronectin receptor antagonists. Part 3: Squaric acid amides. Bioorg Med Chem Lett 17:6151-4 (2007)  
Target
Name:
Integrin alpha-IIb/beta-3
Synonyms:
Glycoprotein IIb/IIIa
Type:
Mol. Mass.:
Description:
ASSAY_ID of EBI is 30109
Components:
This complex has 2 components.
Component 1
Name:
Integrin beta-3
Synonyms:
CD_antigen=CD61 GPIIIa ITGB3 Platelet membrane glycoprotein IIIa
Type:
Protein
Mol. Mass.:
87038.91
Organism:
Homo sapiens (Human)
Description:
P05106
Residue:
788
  
Component 2
Name:
Integrin alpha-IIb
Synonyms:
CD_antigen=CD41 GPIIb Glycoprotein IIb ITGA2B Integrin alpha-IIb heavy chain Integrin alpha-IIb light chain, form 2 Integrin alpha-V/beta-3 and alpha-IIb/beta 3 | Platelet membrane glycoprotein IIb
Type:
Protein
Mol. Mass.:
113354.85
Organism:
Homo sapiens (Human)
Description:
P08514
Residue:
1039
  
Inhibitor
Name:
BDBM50223891
Synonyms:
(S)-3-[3'-(2-cyclopropylamino-3,4-dioxo-cyclobut-1-enylamino)-biphenyl-4-yl]-2-(2,4,6-trimethyl-benzenesulfonylamino)-propionic acid | CHEMBL249990
Type:
Small organic molecule
Emp. Form.:
C31H31N3O6S
Mol. Mass.:
573.659
SMILES:
Cc1cc(C)c(c(C)c1)S(=O)(=O)N[C@@H](Cc1ccc(cc1)-c1cccc(Nc2c(NC3CC3)c(=O)c2=O)c1)C(O)=O
: