Target
Integrin alpha-V/beta-3
Ligand
BDBM50125297
Substrate
Meas. Tech.
ChEMBL_458247 (CHEMBL925582)
Ki
11±n/a nM
Citation
 Urbahns, KHärter, MAlbers, MSchmidt, DStelte-Ludwig, BBrüggemeier, UVaupel, AKeldenich, JLustig, KTsujishita, HGerdes, C Biphenyls as potent vitronectin receptor antagonists. Part 3: Squaric acid amides. Bioorg Med Chem Lett 17:6151-4 (2007)  
Target
Name:
Integrin alpha-V/beta-3
Synonyms:
ITGAV/ITGB3 | Integrin beta-3/Vitronectin receptor alpha
Type:
Enzyme
Mol. Mass.:
Description:
Components:
This complex has 2 components.
Component 1
Name:
Integrin alpha-V
Synonyms:
ITAV_HUMAN Integrin alpha-V/alpha-5 VNRA Vitronectin receptor | Vitronectin receptor subunit alpha
Type:
PROTEIN
Mol. Mass.:
116024.92
Organism:
Homo sapiens (Human)
Description:
ChEMBL_582336
Residue:
1048
  
Component 2
Name:
Integrin beta-3
Synonyms:
CD_antigen=CD61 GPIIIa ITGB3 Platelet membrane glycoprotein IIIa
Type:
Protein
Mol. Mass.:
87038.91
Organism:
Homo sapiens (Human)
Description:
P05106
Residue:
788
  
Inhibitor
Name:
BDBM50125297
Synonyms:
(S)-3-(3'-Guanidino-biphenyl-4-yl)-2-(2,4,6-trimethyl-benzenesulfonylamino)-propionic acid | CHEMBL10839
Type:
Small organic molecule
Emp. Form.:
C25H28N4O4S
Mol. Mass.:
480.579
SMILES:
[#6]-c1cc(-[#6])c(c(-[#6])c1)S(=O)(=O)[#7]-[#6@@H](-[#6]-c1ccc(cc1)-c1cccc(c1)\[#7]=[#6](/[#7])-[#7])-[#6](-[#8])=O
: