Target
Cytochrome P450 2C9
Ligand
BDBM50224104
Substrate
Meas. Tech.
ChEMBL_450437 (CHEMBL899614)
IC50
>40000±n/a nM
Citation
 Ahlström, MMRidderström, MZamora, I CYP2C9 structure-metabolism relationships: substrates, inhibitors, and metabolites. J Med Chem 50:5382-91 (2007)  
Target
Name:
Cytochrome P450 2C9
Synonyms:
(R)-limonene 6-monooxygenase CP2C9_HUMAN CYP2C9 Cytochrome P450 2C9 (CYP2C9 ) P-450MP P450 PB-1 | S-mephenytoin 4-hydroxylase
Type:
Enzyme
Mol. Mass.:
55636.33
Organism:
Homo sapiens (Human)
Description:
P11712
Residue:
490
  
Inhibitor
Name:
BDBM50224104
Synonyms:
4-(3-(trifluoromethyl)-5-(4-(trifluoromethyl)phenyl)-1H-pyrazol-1-yl)benzoic acid CHEMBL242403
Type:
Small organic molecule
Emp. Form.:
C18H10F6N2O2
Mol. Mass.:
400.2746
SMILES:
OC(=O)c1ccc(cc1)-n1nc(cc1-c1ccc(cc1)C(F)(F)F)C(F)(F)F
: