Target
Cytochrome P450 2C9
Ligand
BDBM50224110
Substrate
Meas. Tech.
ChEMBL_450437 (CHEMBL899614)
IC50
26000±n/a nM
Citation
 Ahlström, MMRidderström, MZamora, I CYP2C9 structure-metabolism relationships: substrates, inhibitors, and metabolites. J Med Chem 50:5382-91 (2007)  
Target
Name:
Cytochrome P450 2C9
Synonyms:
(R)-limonene 6-monooxygenase CP2C9_HUMAN CYP2C9 Cytochrome P450 2C9 (CYP2C9 ) P-450MP P450 PB-1 | S-mephenytoin 4-hydroxylase
Type:
Enzyme
Mol. Mass.:
55636.33
Organism:
Homo sapiens (Human)
Description:
P11712
Residue:
490
  
Inhibitor
Name:
BDBM50224110
Synonyms:
1-(4-(methylsulfinyl)phenyl)-5-p-tolyl-3-(trifluoromethyl)-1H-pyrazole CHEMBL397230
Type:
Small organic molecule
Emp. Form.:
C18H15F3N2OS
Mol. Mass.:
364.385
SMILES:
Cc1ccc(cc1)-c1cc(nn1-c1ccc(cc1)S(C)=O)C(F)(F)F
: