Target
Oxysterols receptor LXR-beta
Ligand
BDBM50227147
Substrate
Meas. Tech.
ChEMBL_461472 (CHEMBL927483)
IC50
15±n/a nM
Citation
 Hu, BQuinet, EUnwalla, RCollini, MJetter, JDooley, RAndraka, DNogle, LSavio, DHalpern, AGoos-Nilsson, AWilhelmsson, ANambi, PWrobel, J Carboxylic acid based quinolines as liver X receptor modulators that have LXRbeta receptor binding selectivity. Bioorg Med Chem Lett 18:54-9 (2008)  
Target
Name:
Oxysterols receptor LXR-beta
Synonyms:
LXRB Liver X, LXR beta NR1H2 Nuclear receptor NER Ubiquitously-expressed nuclear receptor
Type:
Enzyme Catalytic Domain
Mol. Mass.:
50978.79
Organism:
Homo sapiens (Human)
Description:
P55055
Residue:
460
  
Inhibitor
Name:
BDBM50227147
Synonyms:
2-(5-((3-(8-(trifluoromethyl)quinolin-4-yl)phenyl)methylamino)naphthalen-1-yl)acetic acid | CHEMBL253731
Type:
Small organic molecule
Emp. Form.:
C29H21F3N2O2
Mol. Mass.:
486.4844
SMILES:
OC(=O)Cc1cccc2c(NCc3cccc(c3)-c3ccnc4c(cccc34)C(F)(F)F)cccc12
: