Target
Tyrosine-protein phosphatase non-receptor type 1
Ligand
BDBM50228013
Substrate
Meas. Tech.
ChEMBL_461676 (CHEMBL927697)
IC50
23±n/a nM
Citation
 Douty, BWayland, BAla, PJBower, MJPruitt, JBostrom, LWei, MKlabe, RGonneville, LWynn, RBurn, TCLiu, PCCombs, APYue, EW Isothiazolidinone inhibitors of PTP1B containing imidazoles and imidazolines. Bioorg Med Chem Lett 18:66-71 (2008)  
Target
Name:
Tyrosine-protein phosphatase non-receptor type 1
Synonyms:
PTN1_HUMAN PTPN1 Protein tyrosine phosphatase-1B (PTP1B) Protein-tyrosine phosphatase 1B (PTP1B) Tyrosine-protein phosphatase non-receptor type 1 (PTP1B)
Type:
Protein phosphatase
Mol. Mass.:
49963.76
Organism:
Homo sapiens (Human)
Description:
Human recombinant GST-fusion PTP1B (1-435).
Residue:
435
  
Inhibitor
Name:
BDBM50228013
Synonyms:
3-fluoro-N-{1-{(R)-5-[2-(3-methanesulfonyl-phenoxy)-ethyl]-4,5-dihydro-1H-imidazol-2-yl}-2-[3-methyl-4-(1,1,3-trioxo-1lambda6-isothiazolidin-5-yl)-phenyl]-ethyl}-benzenesulfonamide | CHEMBL253476
Type:
Small organic molecule
Emp. Form.:
C30H33FN4O8S3
Mol. Mass.:
692.798
SMILES:
Cc1cc(CC(NS(=O)(=O)c2cccc(F)c2)C2=NC[C@@H](CCOc3cccc(c3)S(C)(=O)=O)N2)ccc1C1CC(=O)NS1(=O)=O
: