Target
Muscarinic acetylcholine receptor M1
Ligand
BDBM50228406
Substrate
Meas. Tech.
ChEMBL_452481 (CHEMBL902718)
IC50
430±n/a nM
Citation
 Eckhardt, MLangkopf, EMark, MTadayyon, MThomas, LNar, HPfrengle, WGuth, BLotz, RSieger, PFuchs, HHimmelsbach, F 8-(3-(R)-aminopiperidin-1-yl)-7-but-2-ynyl-3-methyl-1-(4-methyl-quinazolin-2-ylmethyl)-3,7-dihydropurine-2,6-dione (BI 1356), a highly potent, selective, long-acting, and orally bioavailable DPP-4 inhibitor for the treatment of type 2 diabetes. J Med Chem 50:6450-3 (2007)  
Target
Name:
Muscarinic acetylcholine receptor M1
Synonyms:
ACM1_HUMAN Cholinergic receptor, muscarinic 1 | Cholinergic, muscarinic M1
Type:
Protein
Mol. Mass.:
51442.54
Organism:
Homo sapiens (Human)
Description:
P11229
Residue:
460
  
Inhibitor
Name:
BDBM50228406
Synonyms:
(R)-8-(3-aminopiperidin-1-yl)-7-(but-2-ynyl)-3-methyl-1-((3-methylisoquinolin-1-yl)methyl)-1H-purine-2,6(3H,7H)-dione US10202383, Example 2(130) US9556175, 2(130)
Type:
Small organic molecule
Emp. Form.:
C26H29N7O2
Mol. Mass.:
471.5542
SMILES:
CC#CCn1c(nc2n(C)c(=O)n(Cc3nc(C)cc4ccccc34)c(=O)c12)N1CCC[C@@H](N)C1
: