Target
Cruzipain
Ligand
BDBM50229125
Substrate
Meas. Tech.
ChEMBL_461748 (CHEMBL928879)
Ki
280±n/a nM
Citation
 Jaishankar, PHansell, EZhao, DMDoyle, PSMcKerrow, JHRenslo, AR Potency and selectivity of P2/P3-modified inhibitors of cysteine proteases from trypanosomes. Bioorg Med Chem Lett 18:624-8 (2008)  
Target
Name:
Cruzipain
Synonyms:
CYSP_TRYCR Cruzaine | Major cysteine proteinase
Type:
Protein
Mol. Mass.:
49831.41
Organism:
Trypanosoma cruzi
Description:
P25779
Residue:
467
  
Inhibitor
Name:
BDBM50229125
Synonyms:
CHEMBL442284 | N-((S)-1-oxo-1-((S)-5-phenyl-1-(phenylsulfonyl)pent-1-en-3-ylamino)-3-m-tolylpropan-2-yl)picolinamide
Type:
Small organic molecule
Emp. Form.:
C33H33N3O4S
Mol. Mass.:
567.698
SMILES:
Cc1cccc(C[C@H](NC(=O)c2ccccn2)C(=O)N[C@@H](CCc2ccccc2)\C=C\S(=O)(=O)c2ccccc2)c1
: