Target
Histone deacetylase 8
Ligand
BDBM50229192
Substrate
Meas. Tech.
ChEMBL_461762 (CHEMBL927768)
IC50
>50000±n/a nM
Citation
 Witter, DJHarrington, PWilson, KJChenard, MFleming, JCHaines, BKral, AMSecrist, JPMiller, TA Optimization of biaryl Selective HDAC1&2 Inhibitors (SHI-1:2). Bioorg Med Chem Lett 18:726-31 (2008)  
Target
Name:
Histone deacetylase 8
Synonyms:
HD8 HDAC8_HUMAN Histone deacetylase 8 (HDAC-8) | Human HDAC8
Type:
Enzyme
Mol. Mass.:
41749.60
Organism:
Homo sapiens (Human)
Description:
Q9BY41
Residue:
377
  
Inhibitor
Name:
BDBM50229192
Synonyms:
CHEMBL398420 US9096559, 9 | [4-(4-amino-biphenyl-3-ylcarbamoyl)-benzyl]-carbamic acid methyl ester
Type:
Small organic molecule
Emp. Form.:
C22H21N3O3
Mol. Mass.:
375.4204
SMILES:
COC(=O)NCc1ccc(cc1)C(=O)Nc1cc(ccc1N)-c1ccccc1
: