Target
Peroxisome proliferator-activated receptor alpha
Ligand
BDBM50229207
Substrate
Meas. Tech.
ChEMBL_461773 (CHEMBL927779)
EC50
60±n/a nM
Citation
 Faucher, NMartres, PLaroze, APineau, OPotvain, FGrillot, D Design, synthesis and evaluation of trifluoromethane sulfonamide derivatives as new potent and selective peroxisome proliferator-activated receptor alpha agonists. Bioorg Med Chem Lett 18:710-5 (2008)  
Target
Name:
Peroxisome proliferator-activated receptor alpha
Synonyms:
NR1C1 PPAR PPAR-alpha PPARA_HUMAN Peroxisome proliferator-activated receptor | Peroxisome proliferator-activated receptor alpha (PPAR alpha)
Type:
Enzyme
Mol. Mass.:
52222.08
Organism:
Homo sapiens (Human)
Description:
Q07869
Residue:
468
  
Inhibitor
Name:
BDBM50229207
Synonyms:
CHEMBL403637 | N-(4-(trifluoromethylsulfonamido)benzyl)-4-(4-methylthiazol-2-yl)benzamide
Type:
Small organic molecule
Emp. Form.:
C19H16F3N3O3S2
Mol. Mass.:
455.474
SMILES:
Cc1csc(n1)-c1ccc(cc1)C(=O)NCc1ccc(NS(=O)(=O)C(F)(F)F)cc1
: