Target
Peroxisome proliferator-activated receptor gamma
Ligand
BDBM50229205
Substrate
Meas. Tech.
ChEMBL_461781 (CHEMBL927787)
EC50
>10000±n/a nM
Citation
 Faucher, NMartres, PLaroze, APineau, OPotvain, FGrillot, D Design, synthesis and evaluation of trifluoromethane sulfonamide derivatives as new potent and selective peroxisome proliferator-activated receptor alpha agonists. Bioorg Med Chem Lett 18:710-5 (2008)  
Target
Name:
Peroxisome proliferator-activated receptor gamma
Synonyms:
Nr1c3 PPAR-gamma Pparg
Type:
PROTEIN
Mol. Mass.:
57593.55
Organism:
Mus musculus
Description:
ChEMBL_1453700
Residue:
505
  
Inhibitor
Name:
BDBM50229205
Synonyms:
CHEMBL253520 | N-(4-((trifluoromethylsulfonamido)methyl)benzyl)-4-methyl-2-(4-(trifluoromethyl)phenyl)thiazole-5-carboxamide
Type:
Small organic molecule
Emp. Form.:
C21H17F6N3O3S2
Mol. Mass.:
537.498
SMILES:
Cc1nc(sc1C(=O)NCc1ccc(CNS(=O)(=O)C(F)(F)F)cc1)-c1ccc(cc1)C(F)(F)F
: