Target
Peroxisome proliferator-activated receptor gamma
Ligand
BDBM50229216
Substrate
Meas. Tech.
ChEMBL_461779 (CHEMBL927785)
EC50
>10000±n/a nM
Citation
 Faucher, NMartres, PLaroze, APineau, OPotvain, FGrillot, D Design, synthesis and evaluation of trifluoromethane sulfonamide derivatives as new potent and selective peroxisome proliferator-activated receptor alpha agonists. Bioorg Med Chem Lett 18:710-5 (2008)  
Target
Name:
Peroxisome proliferator-activated receptor gamma
Synonyms:
NR1C3 PPAR-gamma PPARG_HUMAN Peroxisome proliferator-activated receptor gamma (PPAR gamma) Peroxisome proliferator-activated receptor gamma (PPARĪ³) peroxisome proliferator-activated receptor gamma isoform 2
Type:
Nuclear Receptor
Mol. Mass.:
57613.46
Organism:
Homo sapiens (Human)
Description:
P37231
Residue:
505
  
Inhibitor
Name:
BDBM50229216
Synonyms:
CHEMBL254742 | N-(4-(2-hydroxy-3,4-dioxocyclobut-1-enyl)benzyl)-4-methyl-2-(4-(trifluoromethyl)phenyl)thiazole-5-carboxamide
Type:
Small organic molecule
Emp. Form.:
C23H15F3N2O4S
Mol. Mass.:
472.436
SMILES:
Cc1nc(sc1C(=O)NCc1ccc(cc1)-c1c(O)c(=O)c1=O)-c1ccc(cc1)C(F)(F)F
: