Target
Peroxisome proliferator-activated receptor alpha
Ligand
BDBM50229221
Substrate
Meas. Tech.
ChEMBL_461773 (CHEMBL927779)
EC50
80±n/a nM
Citation
 Faucher, NMartres, PLaroze, APineau, OPotvain, FGrillot, D Design, synthesis and evaluation of trifluoromethane sulfonamide derivatives as new potent and selective peroxisome proliferator-activated receptor alpha agonists. Bioorg Med Chem Lett 18:710-5 (2008)  
Target
Name:
Peroxisome proliferator-activated receptor alpha
Synonyms:
NR1C1 PPAR PPAR-alpha PPARA_HUMAN Peroxisome proliferator-activated receptor | Peroxisome proliferator-activated receptor alpha (PPAR alpha)
Type:
Enzyme
Mol. Mass.:
52222.08
Organism:
Homo sapiens (Human)
Description:
Q07869
Residue:
468
  
Inhibitor
Name:
BDBM50229221
Synonyms:
2-(4'-chloro-biphenyl-4-yl)-N-(4-trifluoromethanesulfonylamino-benzyl)-acetamide | CHEMBL253923
Type:
Small organic molecule
Emp. Form.:
C22H18ClF3N2O3S
Mol. Mass.:
482.903
SMILES:
FC(F)(F)S(=O)(=O)Nc1ccc(CNC(=O)Cc2ccc(cc2)-c2ccc(Cl)cc2)cc1
: