Target
Peroxisome proliferator-activated receptor gamma
Ligand
BDBM50229222
Substrate
Meas. Tech.
ChEMBL_461779 (CHEMBL927785)
EC50
5500±n/a nM
Citation
 Faucher, NMartres, PLaroze, APineau, OPotvain, FGrillot, D Design, synthesis and evaluation of trifluoromethane sulfonamide derivatives as new potent and selective peroxisome proliferator-activated receptor alpha agonists. Bioorg Med Chem Lett 18:710-5 (2008)  
Target
Name:
Peroxisome proliferator-activated receptor gamma
Synonyms:
NR1C3 PPAR-gamma PPARG_HUMAN Peroxisome proliferator-activated receptor gamma (PPAR gamma) Peroxisome proliferator-activated receptor gamma (PPARĪ³) peroxisome proliferator-activated receptor gamma isoform 2
Type:
Nuclear Receptor
Mol. Mass.:
57613.46
Organism:
Homo sapiens (Human)
Description:
P37231
Residue:
505
  
Inhibitor
Name:
BDBM50229222
Synonyms:
CHEMBL253109 | N-(4-(butylsulfonamido)benzyl)-4-methyl-2-(4-(trifluoromethyl)phenyl)thiazole-5-carboxamide
Type:
Small organic molecule
Emp. Form.:
C23H24F3N3O3S2
Mol. Mass.:
511.58
SMILES:
CCCCS(=O)(=O)Nc1ccc(CNC(=O)c2sc(nc2C)-c2ccc(cc2)C(F)(F)F)cc1
: