Target
Peroxisome proliferator-activated receptor alpha
Ligand
BDBM50229212
Substrate
Meas. Tech.
ChEMBL_461774 (CHEMBL927780)
EC50
>10000±n/a nM
Citation
 Faucher, NMartres, PLaroze, APineau, OPotvain, FGrillot, D Design, synthesis and evaluation of trifluoromethane sulfonamide derivatives as new potent and selective peroxisome proliferator-activated receptor alpha agonists. Bioorg Med Chem Lett 18:710-5 (2008)  
Target
Name:
Peroxisome proliferator-activated receptor alpha
Synonyms:
Nr1c1 PPAR-alpha Peroxisome Proliferator-Activated Receptor alpha Ppara
Type:
PROTEIN
Mol. Mass.:
52343.28
Organism:
Mus musculus
Description:
ChEMBL_572395
Residue:
468
  
Inhibitor
Name:
BDBM50229212
Synonyms:
CHEMBL254946 | N-(4-(propan-2-ylsulfonamido)benzyl)-4-methyl-2-(4-(trifluoromethyl)phenyl)thiazole-5-carboxamide
Type:
Small organic molecule
Emp. Form.:
C22H22F3N3O3S2
Mol. Mass.:
497.554
SMILES:
CC(C)S(=O)(=O)Nc1ccc(CNC(=O)c2sc(nc2C)-c2ccc(cc2)C(F)(F)F)cc1
: