Target
Peroxisome proliferator-activated receptor alpha
Ligand
BDBM50229220
Substrate
Meas. Tech.
ChEMBL_461774 (CHEMBL927780)
EC50
800±n/a nM
Citation
 Faucher, NMartres, PLaroze, APineau, OPotvain, FGrillot, D Design, synthesis and evaluation of trifluoromethane sulfonamide derivatives as new potent and selective peroxisome proliferator-activated receptor alpha agonists. Bioorg Med Chem Lett 18:710-5 (2008)  
Target
Name:
Peroxisome proliferator-activated receptor alpha
Synonyms:
Nr1c1 PPAR-alpha Peroxisome Proliferator-Activated Receptor alpha Ppara
Type:
PROTEIN
Mol. Mass.:
52343.28
Organism:
Mus musculus
Description:
ChEMBL_572395
Residue:
468
  
Inhibitor
Name:
BDBM50229220
Synonyms:
CHEMBL254744 | N-(4-(methylsulfonamido)benzyl)-4-methyl-2-(4-(trifluoromethyl)phenyl)thiazole-5-carboxamide
Type:
Small organic molecule
Emp. Form.:
C20H18F3N3O3S2
Mol. Mass.:
469.5
SMILES:
Cc1nc(sc1C(=O)NCc1ccc(NS(C)(=O)=O)cc1)-c1ccc(cc1)C(F)(F)F
: