Target
Peroxisome proliferator-activated receptor delta
Ligand
BDBM28706
Substrate
Meas. Tech.
ChEMBL_461775 (CHEMBL927781)
EC50
2800±n/a nM
Citation
 Faucher, NMartres, PLaroze, APineau, OPotvain, FGrillot, D Design, synthesis and evaluation of trifluoromethane sulfonamide derivatives as new potent and selective peroxisome proliferator-activated receptor alpha agonists. Bioorg Med Chem Lett 18:710-5 (2008)  
Target
Name:
Peroxisome proliferator-activated receptor delta
Synonyms:
NR1C2 NUCI Nuclear receptor subfamily 1 group C member 2 PPAR-beta PPARD Peroxisome proliferator-activated receptor Peroxisome proliferator-activated receptor delta
Type:
Enzyme
Mol. Mass.:
49910.45
Organism:
Homo sapiens (Human)
Description:
Q03181
Residue:
441
  
Inhibitor
Name:
BDBM28706
Synonyms:
2-methyl-2-phenoxypropanoic acid, 25a CHEMBL219586
Type:
Small organic molecule
Emp. Form.:
C23H21F3N2O4S
Mol. Mass.:
478.484
SMILES:
Cc1nc(sc1C(=O)NCc1ccc(OC(C)(C)C(O)=O)cc1)-c1ccc(cc1)C(F)(F)F
: