Target
Peroxisome proliferator-activated receptor alpha
Ligand
BDBM50229213
Substrate
Meas. Tech.
ChEMBL_461774 (CHEMBL927780)
EC50
>25000±n/a nM
Citation
 Faucher, NMartres, PLaroze, APineau, OPotvain, FGrillot, D Design, synthesis and evaluation of trifluoromethane sulfonamide derivatives as new potent and selective peroxisome proliferator-activated receptor alpha agonists. Bioorg Med Chem Lett 18:710-5 (2008)  
Target
Name:
Peroxisome proliferator-activated receptor alpha
Synonyms:
Nr1c1 PPAR-alpha Peroxisome Proliferator-Activated Receptor alpha Ppara
Type:
PROTEIN
Mol. Mass.:
52343.28
Organism:
Mus musculus
Description:
ChEMBL_572395
Residue:
468
  
Inhibitor
Name:
BDBM50229213
Synonyms:
2-methyl-2-(4-((4-(4-methylthiazol-2-yl)benzamido)methyl)phenoxy)propanoic acid | CHEMBL253522
Type:
Small organic molecule
Emp. Form.:
C22H22N2O4S
Mol. Mass.:
410.486
SMILES:
Cc1csc(n1)-c1ccc(cc1)C(=O)NCc1ccc(OC(C)(C)C(O)=O)cc1
: