Target
Peroxisome proliferator-activated receptor delta
Ligand
BDBM50229219
Substrate
Meas. Tech.
ChEMBL_461775 (CHEMBL927781)
EC50
>10000±n/a nM
Citation
 Faucher, NMartres, PLaroze, APineau, OPotvain, FGrillot, D Design, synthesis and evaluation of trifluoromethane sulfonamide derivatives as new potent and selective peroxisome proliferator-activated receptor alpha agonists. Bioorg Med Chem Lett 18:710-5 (2008)  
Target
Name:
Peroxisome proliferator-activated receptor delta
Synonyms:
NR1C2 NUCI Nuclear receptor subfamily 1 group C member 2 PPAR-beta PPARD Peroxisome proliferator-activated receptor Peroxisome proliferator-activated receptor delta
Type:
Enzyme
Mol. Mass.:
49910.45
Organism:
Homo sapiens (Human)
Description:
Q03181
Residue:
441
  
Inhibitor
Name:
BDBM50229219
Synonyms:
4'-chloro-biphenyl-4-carboxylic acid 4-trifluoromethanesulfonylamino-benzylamide | CHEMBL252675
Type:
Small organic molecule
Emp. Form.:
C21H16ClF3N2O3S
Mol. Mass.:
468.877
SMILES:
FC(F)(F)S(=O)(=O)Nc1ccc(CNC(=O)c2ccc(cc2)-c2ccc(Cl)cc2)cc1
: