Target
Protein kinase C eta type
Ligand
BDBM50229773
Substrate
Meas. Tech.
ChEMBL_460215 (CHEMBL927265)
Ki
25±n/a nM
Citation
 Yanagita, RCNakagawa, YYamanaka, NKashiwagi, KSaito, NIrie, K Synthesis, conformational analysis, and biological evaluation of 1-hexylindolactam-V10 as a selective activator for novel protein kinase C isozymes. J Med Chem 51:46-56 (2008)  
Target
Name:
Protein kinase C eta type
Synonyms:
KPCL_HUMAN PKCL PRKCL Protein kinase C, PKC; classical/novel | nPKC-eta
Type:
Enzyme
Mol. Mass.:
77844.26
Organism:
Homo sapiens (Human)
Description:
The recombinant human PKC enzymes were produced using a baculovirus expression system in SF9 cells
Residue:
683
  
Inhibitor
Name:
BDBM50229773
Synonyms:
1-hexyl-indolactam-V10 | CHEMBL401369
Type:
Small organic molecule
Emp. Form.:
C24H37N3O2
Mol. Mass.:
399.5695
SMILES:
CCCCCCn1cc2CC[C@@H](CO)NC(=O)[C@H](C(C)C)N(C)c3cccc1c23
: