Target
Protein kinase C eta type
Ligand
BDBM50185931
Substrate
Meas. Tech.
ChEMBL_460215 (CHEMBL927265)
Ki
140±n/a nM
Citation
 Yanagita, RCNakagawa, YYamanaka, NKashiwagi, KSaito, NIrie, K Synthesis, conformational analysis, and biological evaluation of 1-hexylindolactam-V10 as a selective activator for novel protein kinase C isozymes. J Med Chem 51:46-56 (2008)  
Target
Name:
Protein kinase C eta type
Synonyms:
KPCL_HUMAN PKCL PRKCL Protein kinase C, PKC; classical/novel | nPKC-eta
Type:
Enzyme
Mol. Mass.:
77844.26
Organism:
Homo sapiens (Human)
Description:
The recombinant human PKC enzymes were produced using a baculovirus expression system in SF9 cells
Residue:
683
  
Inhibitor
Name:
BDBM50185931
Synonyms:
8-Octyl-benzolactam-V9 | CHEMBL206866
Type:
Small organic molecule
Emp. Form.:
C24H40N2O2
Mol. Mass.:
388.5866
SMILES:
CCCCCCCCc1cccc2N(C)[C@@H](C(C)C)C(=O)N[C@H](CO)CCc12
: