Target
Growth hormone secretagogue receptor type 1
Ligand
BDBM50232263
Substrate
Meas. Tech.
ChEMBL_460936 (CHEMBL944884)
EC50
16±n/a nM
Citation
 Moulin, ADemange, LRyan, JMousseaux, DSanchez, PBergé, GGagne, DPerrissoud, DLocatelli, VTorsello, AGalleyrand, JCFehrentz, JAMartinez, J New trisubstituted 1,2,4-triazole derivatives as potent ghrelin receptor antagonists. 3. Synthesis and pharmacological in vitro and in vivo evaluations. J Med Chem 51:689-93 (2008)  
Target
Name:
Growth hormone secretagogue receptor type 1
Synonyms:
GH-releasing peptide receptor GHS-R GHSR_HUMAN Ghrelin receptor | Ghrelin receptor 1a (GHS-R1a)
Type:
Receptor
Mol. Mass.:
41334.57
Organism:
Homo sapiens (Human)
Description:
Receptor binding studies use plasma membranes from LLC PK-1 cells transiently transfected with hGHSR1a.
Residue:
366
  
Inhibitor
Name:
BDBM50232263
Synonyms:
(R)-N-((4-(2,4-dimethoxybenzyl)-5-phenethyl-4H-1,2,4-triazol-3-yl)(1H-indol-3-yl)methyl)benzamide | CHEMBL399651
Type:
Small organic molecule
Emp. Form.:
C35H33N5O3
Mol. Mass.:
571.6682
SMILES:
COc1ccc(Cn2c(CCc3ccccc3)nnc2[C@H](NC(=O)c2ccccc2)c2c[nH]c3ccccc23)c(OC)c1
: