Target
Tyrosine-protein kinase Lck
Ligand
BDBM50236475
Substrate
Meas. Tech.
ChEMBL_463025 (CHEMBL929949)
IC50
>50000±n/a nM
Citation
 Hynes, JWu, HPitt, SShen, DRZhang, RSchieven, GLGillooly, KMShuster, DJTaylor, TLYang, XMcIntyre, KWMcKinnon, MZhang, HMarathe, PHDoweyko, AMKish, KKiefer, SESack, JSNewitt, JABarrish, JCDodd, JLeftheris, K The discovery of (R)-2-(sec-butylamino)-N-(2-methyl-5-(methylcarbamoyl)phenyl) thiazole-5-carboxamide (BMS-640994)-A potent and efficacious p38alpha MAP kinase inhibitor. Bioorg Med Chem Lett 18:1762-7 (2008)  
Target
Name:
Tyrosine-protein kinase Lck
Synonyms:
2.7.10.2 LCK_HUMAN Leukocyte C-terminal Src kinase Lymphocyte-specific protein tyrosine kinase Protein YT16 Proto-oncogene tyrosine-protein kinase LCK T cell-specific protein-tyrosine kinase
Type:
Mol. Mass.:
57987.83
Organism:
Homo sapiens (Human)
Description:
P06239
Residue:
509
  
Inhibitor
Name:
BDBM50236475
Synonyms:
2-(isopropylamino)-N-(2-methyl-5-(methylcarbamoyl)phenyl)thiazole-5-carboxamide | CHEMBL258201
Type:
Small organic molecule
Emp. Form.:
C16H20N4O2S
Mol. Mass.:
332.421
SMILES:
CNC(=O)c1ccc(C)c(NC(=O)c2cnc(NC(C)C)s2)c1
: