Target
Ornithine decarboxylase
Ligand
BDBM50241693
Substrate
Meas. Tech.
ChEMBL_526382 (CHEMBL970064)
IC50
2300±n/a nM
Citation
 Fang, NCasida, JE New bioactive flavonoids and stilbenes in cubé resin insecticide. J Nat Prod 62:205-10 (1999)  
Target
Name:
Ornithine decarboxylase
Synonyms:
DCOR_HUMAN ODC1
Type:
PROTEIN
Mol. Mass.:
51136.54
Organism:
Homo sapiens (Human)
Description:
ChEMBL_423773
Residue:
461
  
Inhibitor
Name:
BDBM50241693
Synonyms:
(2S)-6-(gamma,gamma-dimethylallyl)-3',4'-dimethoxy-6'',6''-dimethylpyran[2'',3'':7,8]flavanone | CHEMBL516860
Type:
Small organic molecule
Emp. Form.:
C27H30O5
Mol. Mass.:
434.5241
SMILES:
[#6]-[#8]-c1ccc(cc1-[#8]-[#6])-[#6@@H]-1-[#6]-[#6](=O)-c2cc(-[#6]\[#6]=[#6](\[#6])-[#6])c3-[#8]C([#6])([#6])[#6]=[#6]-c3c2-[#8]-1
: