Target
Ornithine decarboxylase
Ligand
BDBM50241698
Substrate
Meas. Tech.
ChEMBL_526382 (CHEMBL970064)
IC50
3900±n/a nM
Citation
 Fang, NCasida, JE New bioactive flavonoids and stilbenes in cubé resin insecticide. J Nat Prod 62:205-10 (1999)  
Target
Name:
Ornithine decarboxylase
Synonyms:
DCOR_HUMAN ODC1
Type:
PROTEIN
Mol. Mass.:
51136.54
Organism:
Homo sapiens (Human)
Description:
ChEMBL_423773
Residue:
461
  
Inhibitor
Name:
BDBM50241698
Synonyms:
3,4,5-trimethoxy-6'',6''-dimethylpyran[2'',3'':3',4']stilbene | CHEMBL463011
Type:
Small organic molecule
Emp. Form.:
C22H24O4
Mol. Mass.:
352.4236
SMILES:
COc1cc(\C=C\c2ccc3C=CC(C)(C)Oc3c2)cc(OC)c1OC
: