Target
C-C chemokine receptor type 5
Ligand
BDBM50242056
Substrate
Meas. Tech.
ChEMBL_504350 (CHEMBL990184)
IC50
80000±n/a nM
Citation
 Yoganathan, KRossant, CNg, SHuang, YButler, MSBuss, AD 10-Methoxydihydrofuscin, fuscinarin, and fuscin, novel antagonists of the human CCR5 receptor from Oidiodendron griseum. J Nat Prod 66:1116-7 (2003)  
Target
Name:
C-C chemokine receptor type 5
Synonyms:
C-C CKR-5 CC-CKR-5 CCR5 CCR5_HUMAN CHEMR13 HIV-1 fusion coreceptor
Type:
Enzyme
Mol. Mass.:
40540.21
Organism:
Homo sapiens (Human)
Description:
P51681
Residue:
352
  
Inhibitor
Name:
BDBM50242056
Synonyms:
CHEMBL469856 | fuscinarin
Type:
Small organic molecule
Emp. Form.:
C14H16O5
Mol. Mass.:
264.2738
SMILES:
CC1OC(=O)c2c1c(O)c(O)c1OC(C)(C)CCc21
: