Target
Proto-oncogene tyrosine-protein kinase Src
Ligand
BDBM12255
Substrate
Meas. Tech.
ChEMBL_508801 (CHEMBL997069)
IC50
1±n/a nM
Citation
 Chu, JJYang, PL c-Src protein kinase inhibitors block assembly and maturation of dengue virus. Proc Natl Acad Sci U S A 104:3520-5 (2007)  
Target
Name:
Proto-oncogene tyrosine-protein kinase Src
Synonyms:
Calmodulin/Proto-oncogene tyrosine-protein kinase Src Proto-oncogene c-Src SRC SRC_HUMAN V-src sarcoma (Schmidt-Ruppin A-2) viral oncogene homolog (avian) p60-Src | pp60c-src
Type:
Protein
Mol. Mass.:
59838.60
Organism:
Homo sapiens (Human)
Description:
P12931
Residue:
536
  
Inhibitor
Name:
BDBM12255
Synonyms:
AZD0530 Compound 33 Saracatinib | med.21724, Compound 189
Type:
Small organic molecule
Emp. Form.:
C27H32ClN5O5
Mol. Mass.:
542.026
SMILES:
CN1CCN(CCOc2cc(OC3CCOCC3)c3c(Nc4c5OCOc5ccc4Cl)ncnc3c2)CC1
: