Target
Estrogen receptor beta
Ligand
BDBM50154140
Substrate
Meas. Tech.
ChEMBL_530438 (CHEMBL973102)
IC50
2.2±n/a nM
Citation
 Luan, FLiu, HTMa, WPFan, BT Classification of estrogen receptor-beta ligands on the basis of their binding affinities using support vector machine and linear discriminant analysis. Eur J Med Chem 43:43-52 (2008)  
Target
Name:
Estrogen receptor beta
Synonyms:
ER-beta ESR2_HUMAN Estradiol receptor beta (ERβ) Estrogen receptor (ER beta) Estrogen receptor beta (ER beta) NR3A2 estrogen beta
Type:
Protein
Mol. Mass.:
59238.43
Organism:
Homo sapiens (Human)
Description:
Q92731
Residue:
530
  
Inhibitor
Name:
BDBM50154140
Synonyms:
2-(2-Fluoro-4-hydroxy-phenyl)-7-vinyl-benzooxazol-5-ol 2-(3-fluoro-4-hydroxyphenyl)-7-vinylbenzo[d]oxazol-5-ol | CHEMBL188846
Type:
Small organic molecule
Emp. Form.:
C15H10FNO3
Mol. Mass.:
271.2432
SMILES:
Oc1ccc(-c2nc3cc(O)cc(C=C)c3o2)c(F)c1
: