Target
Furin
Ligand
BDBM50270170
Substrate
Meas. Tech.
ChEMBL_508163 (CHEMBL1008221)
Ki
93±n/a nM
Citation
 Shiryaev, SARemacle, AGRatnikov, BINelson, NASavinov, AYWei, GBottini, MRega, MFParent, ADesjardins, RFugere, MDay, RSabet, MPellecchia, MLiddington, RCSmith, JWMustelin, TGuiney, DGLebl, MStrongin, AY Targeting host cell furin proprotein convertases as a therapeutic strategy against bacterial toxins and viral pathogens. J Biol Chem 282:20847-53 (2007)  
Target
Name:
Furin
Synonyms:
FUR FURIN_HUMAN PACE | PCSK3
Type:
Enzyme Catalytic Domain
Mol. Mass.:
86676.01
Organism:
Homo sapiens (Human)
Description:
P09958
Residue:
794
  
Inhibitor
Name:
BDBM50270170
Synonyms:
CHEMBL446203 | TPQRARRRKKR5
Type:
Small organic molecule
Emp. Form.:
C63H120N30O15S
Mol. Mass.:
1569.884
SMILES:
[#6]-[#16]-[#6]-[#6@H](-[#7]-[#6](=O)-[#6@H](-[#6]-[#6]-[#6]\[#7]=[#6](/[#7])-[#7])-[#7]-[#6](=O)-[#6@H](-[#6]-[#6]-[#6]-[#6]-[#7])-[#7]-[#6](=O)-[#6@H](-[#6]-[#6]-[#6]-[#6]-[#7])-[#7]-[#6](=O)-[#6@H](-[#6]-[#6]-[#6]\[#7]=[#6](/[#7])-[#7])-[#7]-[#6](=O)-[#6@H](-[#6]-[#6]-[#6]\[#7]=[#6](/[#7])-[#7])-[#7]-[#6](=O)-[#6@H](-[#6]-[#6]-[#6]\[#7]=[#6](/[#7])-[#7])-[#7]-[#6](=O)-[#6@H](-[#6])-[#7]-[#6](=O)-[#6@H](-[#6]-[#6]-[#6]\[#7]=[#6](/[#7])-[#7])-[#7]-[#6](=O)-[#6@H](-[#6]-[#6]-[#6](-[#7])=O)-[#7]-[#6](=O)-[#6@@H]-1-[#6]-[#6]-[#6]-[#7]-1-[#6](=O)-[#6@@H](-[#7])-[#6@@H](-[#6])-[#8])-[#6](-[#8])=O
: