Target
Beta-lactamase
Ligand
BDBM50021959
Substrate
Meas. Tech.
ChEMBL_516548 (CHEMBL985141)
IC50
9±n/a nM
Citation
 Queenan, AMShang, WKania, MPage, MGBush, K Interactions of ceftobiprole with beta-lactamases from molecular classes A to D. Antimicrob Agents Chemother 51:3089-95 (2007)  
Target
Name:
Beta-lactamase
Synonyms:
Type:
PROTEIN
Mol. Mass.:
31150.29
Organism:
Escherichia coli
Description:
ChEMBL_516548
Residue:
291
  
Inhibitor
Name:
BDBM50021959
Synonyms:
CHEMBL777 US9120808, Clavulanic acid potassium salt clavulanic acid
Type:
Small organic molecule
Emp. Form.:
C8H9NO5
Mol. Mass.:
199.1608
SMILES:
OC\C=C1/O[C@@H]2CC(=O)N2[C@H]1C(O)=O
: