Target
Mitogen-activated protein kinase kinase kinase 8
Ligand
BDBM50173834
Substrate
Meas. Tech.
ChEMBL_529509 (CHEMBL966653)
IC50
16±n/a nM
Citation
 Hall, JPKurdi, YHsu, SCuozzo, JLiu, JTelliez, JBSeidl, KJWinkler, AHu, YGreen, NAskew, GRTam, SClark, JDLin, LL Pharmacologic inhibition of tpl2 blocks inflammatory responses in primary human monocytes, synoviocytes, and blood. J Biol Chem 282:33295-304 (2007)  
Target
Name:
Mitogen-activated protein kinase kinase kinase 8
Synonyms:
C-COT COT proto-oncogene serine/threonine-protein kinase ESTF MAP3K8 Tumor Progression Loci-2 Kinase (COT) | Tumor progression locus 2
Type:
Serine/threonine-protein kinase
Mol. Mass.:
52916.89
Organism:
Homo sapiens (Human)
Description:
P41279
Residue:
467
  
Inhibitor
Name:
BDBM50173834
Synonyms:
(R)-4-(3-chloro-4-fluorophenylamino)-6-(1-phenylethylamino)-1,7-naphthyridine-3-carbonitrile | CHEMBL199230
Type:
Small organic molecule
Emp. Form.:
C23H17ClFN5
Mol. Mass.:
417.866
SMILES:
C[C@@H](Nc1cc2c(Nc3ccc(F)c(Cl)c3)c(cnc2cn1)C#N)c1ccccc1
: