Target
Serine/threonine-protein kinase Chk1
Ligand
BDBM50245497
Substrate
Meas. Tech.
ChEMBL_511069 (CHEMBL1000361)
IC50
18±n/a nM
Citation
 Smaill, JBBaker, ENBooth, RJBridges, AJDickson, JMDobrusin, EMIvanovic, IKraker, AJLee, HHLunney, EAOrtwine, DFPalmer, BDQuin, JSquire, CJThompson, AMDenny, WA Synthesis and structure-activity relationships of N-6 substituted analogues of 9-hydroxy-4-phenylpyrrolo[3,4-c]carbazole-1,3(2H,6H)-diones as inhibitors of Wee1 and Chk1 checkpoint kinases. Eur J Med Chem 43:1276-96 (2008)  
Target
Name:
Serine/threonine-protein kinase Chk1
Synonyms:
CHEK1 CHK1 checkpoint homolog Checkpoint kinase-1 (CHK1)
Type:
Enzyme Catalytic Domain
Mol. Mass.:
54443.02
Organism:
Homo sapiens (Human)
Description:
gi_166295192
Residue:
476
  
Inhibitor
Name:
BDBM50245497
Synonyms:
9-Hydroxy-6-(3-hydroxypropyl)-4-(2-methoxyphenyl)-pyrrolo[3,4-c]carbazole-1,3(2H,6H)-dione | 9-hydroxy-6-(3-hydroxypropyl)-4-(2-methoxyphenyl)pyrrolo[3,4-c]carbazole-1,3(2H,6H)-dione
Type:
Small organic molecule
Emp. Form.:
C24H20N2O5
Mol. Mass.:
416.426
SMILES:
COc1ccccc1-c1cc2n(CCCO)c3ccc(O)cc3c2c2C(=O)NC(=O)c12
: