Target
Sigma non-opioid intracellular receptor 1
Ligand
BDBM50265436
Substrate
Meas. Tech.
ChEMBL_497294 (CHEMBL995856)
Ki
0.380000±n/a nM
Citation
 Mercer, SLShaikh, JTraynor, JRMatsumoto, RRCoop, A Nitrile analogs of meperidine as high affinity and selective sigma-1 receptor ligands. Eur J Med Chem 43:1304-8 (2008)  
Target
Name:
Sigma non-opioid intracellular receptor 1
Synonyms:
Opioid receptor SGMR1_RAT Sigma non-opioid intracellular receptor 1 Sigma-1 | Sigmar1
Type:
Enzyme Catalytic Domain
Mol. Mass.:
25266.54
Organism:
RAT
Description:
Q9R0C9
Residue:
223
  
Inhibitor
Name:
BDBM50265436
Synonyms:
1-Phenylpropyl-4-phenylpiperidine-4-carbonitrile | CHEMBL502461
Type:
Small organic molecule
Emp. Form.:
C21H24N2
Mol. Mass.:
304.4287
SMILES:
N#CC1(CCN(CCCc2ccccc2)CC1)c1ccccc1
: