Target
Gonadotropin-releasing hormone receptor
Ligand
BDBM50132732
Substrate
Meas. Tech.
ChEMBL_555922 (CHEMBL956658)
Ki
470±n/a nM
Citation
 Betz, SFZhu, YFChen, CStruthers, RS Non-peptide gonadotropin-releasing hormone receptor antagonists. J Med Chem 51:3331-48 (2008)  
Target
Name:
Gonadotropin-releasing hormone receptor
Synonyms:
GNRHR GRHR GnRH-R Gonadotropin-releasing hormone receptor | Gonadotropin-releasing hormone receptor (GnRH)
Type:
Enzyme
Mol. Mass.:
37749.45
Organism:
Homo sapiens (Human)
Description:
P30968
Residue:
328
  
Inhibitor
Name:
BDBM50132732
Synonyms:
(S)-1-(2,6-difluorobenzyl)-5-(3-methoxyphenyl)-6-methyl-3-(2-(methyl(2-(pyridin-2-yl)ethyl)amino)propyl)pyrimidine-2,4(1H,3H)-dione CHEMBL111820
Type:
Small organic molecule
Emp. Form.:
C30H32F2N4O3
Mol. Mass.:
534.5969
SMILES:
COc1cccc(c1)-c1c(C)n(Cc2c(F)cccc2F)c(=O)n(C[C@H](C)N(C)CCc2ccccn2)c1=O
: