Target
Nitric oxide synthase, brain
Ligand
BDBM50058470
Substrate
Meas. Tech.
ChEMBL_552452 (CHEMBL1002712)
Ki
1100±n/a nM
Citation
 Castaño, TEncinas, APérez, CCastro, ACampillo, NEGil, C Design, synthesis, and evaluation of potential inhibitors of nitric oxide synthase. Bioorg Med Chem 16:6193-206 (2008)  
Target
Name:
Nitric oxide synthase, brain
Synonyms:
Constitutive NOS NC-NOS NOS type I nNOS NOS1_HUMAN Neuronal nitric oxide synthase Nitric oxide synthase, neuronal (nNOS) bNOS | nNOS
Type:
Homodimer
Mol. Mass.:
160985.98
Organism:
Homo sapiens (Human)
Description:
P29475
Residue:
1434
  
Inhibitor
Name:
BDBM50058470
Synonyms:
2-Ethyl-1-(3-trifluoromethyl-phenyl)-isothiourea; hydrochloride CHEMBL544504
Type:
Small organic molecule
Emp. Form.:
C10H11F3N2S
Mol. Mass.:
248.268
SMILES:
CCSC(N)=Nc1cccc(c1)C(F)(F)F
: