Target
5-hydroxytryptamine receptor 1B
Ligand
BDBM50271131
Substrate
Meas. Tech.
ChEMBL_552731 (CHEMBL965237)
Ki
0.100000±n/a nM
Citation
 Choi, SKGreen, DHo, AKlein, UMarquess, DTaylor, RTurner, SD Designing selective, high affinity ligands of 5-HT1D receptor by covalent dimerization of 5-HT1F ligands derived from 4-fluoro-N-[3-(1-methyl-4-piperidinyl)-1H-indol-5-yl]benzamide. J Med Chem 51:3609-16 (2008)  
Target
Name:
5-hydroxytryptamine receptor 1B
Synonyms:
5-HT-1B 5-HT1B 5HT1B_HUMAN HTR1DB Serotonin (5-HT) receptor Serotonin Receptor 1B
Type:
G Protein-Coupled Receptor (GPCR)
Mol. Mass.:
43579.17
Organism:
Homo sapiens (Human)
Description:
Receptor binding assays were performed using human clone stably expressed in CHO cells
Residue:
390
  
Inhibitor
Name:
BDBM50271131
Synonyms:
CHEMBL374973 | N1,N13-bis(3-(1-methylpiperidin-4-yl)-1H-indol-5-yl)tridecanediamide
Type:
Small organic molecule
Emp. Form.:
C41H58N6O2
Mol. Mass.:
666.9382
SMILES:
CN1CCC(CC1)c1c[nH]c2ccc(NC(=O)CCCCCCCCCCCC(=O)Nc3ccc4[nH]cc(C5CCN(C)CC5)c4c3)cc12
: