Target
Cannabinoid receptor 1
Ligand
BDBM50243707
Substrate
Meas. Tech.
ChEMBL_554820 (CHEMBL953973)
Ki
>5000±n/a nM
Citation
 Pagé, DBalaux, EBoisvert, LLiu, ZMilburn, CTremblay, MWei, ZWoo, SLuo, XCheng, YXYang, HSrivastava, SZhou, FBrown, WTomaszewski, MWalpole, CHodzic, LSt-Onge, SGodbout, CSalois, DPayza, KPayza, K Novel benzimidazole derivatives as selective CB2 agonists. Bioorg Med Chem Lett 18:3695-700 (2008)  
Target
Name:
Cannabinoid receptor 1
Synonyms:
CANN6 CB-R CNR CNR1_HUMAN Cannabinoid receptor Cannabinoid receptor 1 (brain)
Type:
G Protein-Coupled Receptor (GPCR)
Mol. Mass.:
52868.96
Organism:
Homo sapiens (Human)
Description:
P21554
Residue:
472
  
Inhibitor
Name:
BDBM50243707
Synonyms:
(S)-2-(4-ethoxybenzyl)-N,N-diethyl-1-((tetrahydrofuran-2-yl)methyl)-1H-benzo[d]imidazole-5-carboxamide | CHEMBL471558
Type:
Small organic molecule
Emp. Form.:
C26H33N3O3
Mol. Mass.:
435.5585
SMILES:
CCOc1ccc(Cc2nc3cc(ccc3n2C[C@@H]2CCCO2)C(=O)N(CC)CC)cc1
: