Target
C-C chemokine receptor type 5
Ligand
BDBM50119337
Substrate
Meas. Tech.
ChEMBL_500129 (CHEMBL974332)
IC50
0.8±n/a nM
Citation
 Zhuo, YKong, RCong, XJChen, WZWang, CX Three-dimensional QSAR analyses of 1,3,4-trisubstituted pyrrolidine-based CCR5 receptor inhibitors. Eur J Med Chem 43:2724-34 (2008)  
Target
Name:
C-C chemokine receptor type 5
Synonyms:
C-C CKR-5 CC-CKR-5 CCR5 CCR5_HUMAN CHEMR13 HIV-1 fusion coreceptor
Type:
Enzyme
Mol. Mass.:
40540.21
Organism:
Homo sapiens (Human)
Description:
P51681
Residue:
352
  
Inhibitor
Name:
BDBM50119337
Synonyms:
(R)-2-((3S,4S)-3-((4-hydroxy-4-(3-phenylpropyl)piperidin-1-yl)methyl)-4-phenylpyrrolidin-1-yl)-2-phenylacetic acid CHEMBL101961
Type:
Small organic molecule
Emp. Form.:
C33H40N2O3
Mol. Mass.:
512.6823
SMILES:
OC(=O)[C@H](N1C[C@H](CN2CCC(O)(CCCc3ccccc3)CC2)[C@H](C1)c1ccccc1)c1ccccc1
: